Boating DUI/BUI
type: Class
alternative label: 酒后驾船/醉船
subclass of: RCqBiJAwLT5iG2nvk12tNKW
definition: Operating a boat or watercraft while under the influence of drugs or alcohol, which is classified as a criminal misdemeanor offense.