Employment Offer
type: Class
preferred label: Job Offer
alternative label: Offer of Employment
alternative label: Position Offer
subclass of: RBila9ckW95W84Tk54tGfZO
definition: A job offer is a formal proposal made by an employer to a candidate selected for a position, detailing the terms and conditions of employment. This includes information about the role, salary, benefits, start date, and other pertinent details.