Total Operating Revenues Clause
type: Class
alternative label: 总营业收入条款
subclass of: RDe0RKU39BlhcyACJW30ZLc
definition: A Total Operating Revenues Clause is a provision in a contract that specifies the total amount of revenue generated by a business during a certain period of time, which is used to calculate payments or other financial obligations under the contract.