Obstruction of Justice
type: Class
alternative label: 妨碍司法
subclass of: R7V9R3w28BDjOd4lLUUrvQ5
definition: The intentional interference with the administration of law or justice, including but not limited to the tampering with or destruction of evidence, the intimidation of witnesses, or the giving of false testimony.