Online Research Expense
type: Class
alternative label: 在线研究费用
subclass of: R8KRPJpptKbBzyQalWni4Zv
definition: An online research expense is a type of expense that is incurred by a party in a legal matter for conducting research on the internet or other online sources.