California Superior Court - San Mateo Cty.
type: Class
subclass of: RsTnyZoBckeYgjbwks7DL8
definition: California Superior Court - San Mateo Cty. is a specific court within the California Superior Court system that has jurisdiction over legal matters within San Mateo County.