Jury Deliberation
type: Class
alternative label: 陪审团商议
subclass of: Rchny3YFXoQyenv6XUbyo0
definition: Jury Deliberation refers to the process by which a group of jurors discuss and analyze evidence presented during a trial in order to reach a verdict.