Outside
type: Class
preferred label: External
alternative label: 外部
subclass of: R8nREeU6lB0zs0dt9N339nm
definition: Actor attribute designating an external role (e.g., Outside Counsel, External Counsel, External Expert).
example: External Counsel
example: External Expert
example: Outside Counsel