Insurer's Breach of Implied Covenant of Good Faith and Fair Dealing
type: Class
alternative label: 保险人违反善意和公平原则
subclass of: R49sp0iRvML6Mzkr06Bimd
subclass of: R9q0hyYnNxQC475BKXOxjbm
definition: The Insurer's Breach of Implied Covenant of Good Faith and Fair Dealing refers to a violation by an insurance company of the obligation to act in good faith and deal fairly with its policyholders, which is implied in every insurance contract.
in scheme: UK