210 Land Condemnation (PACER NoS)
type: Class
subclass of: RbYFWy3aL3B2HCQhVuEWyx
definition: Action by a governmental entity to take privately-owned real property (land or buildings) for public use for compensation.