Interlingua
type: Class
alternative label: 国际语
subclass of: RDOvAHsvY8TKJ1O1orXPM9o
definition: Interlingua is a constructed language developed by the International Auxiliary Language Association for the purpose of facilitating communication between people of different linguistic backgrounds.