M&A F7 Securities Regulatory Matters Practice
type: Class
alternative label: M&A F7证券监管事务实践
subclass of: R8B946ewYpMD86GqDEqxNS
definition: A legal practice area that specializes in advising clients on securities regulatory matters related to mergers and acquisitions.