Construction Industry
type: Class
preferred label: Infrastructure Industry
alternative label: 建筑业
subclass of: RDIwFaFcH4KY0gwEY0QlMTp
hidden label: CON
definition: The Construction industry group comprises establishments primarily engaged in the construction of buildings or engineering projects (e.g., highways and utility systems). Establishments primarily engaged in the preparation of sites for new construction and establishments primarily engaged in subdividing land for sale as building sites also are included in this sector.