Directory Management
type: Class
subclass of: R8HLLl44Pya8Fp0uN3ewKRW
definition: Directory Management is the management of information resources that organize and provide access to a collection of data or documents, within the context of Knowledge Management.