Negligence Per Se
type: Class
alternative label: 违法推定下的疏忽
subclass of: R7nqxxlAfhYqqSA2UQ5UxpX
definition: Negligence Per Se is a legal concept that refers to a situation where an action or failure to act violates a law or regulation, and that violation automatically establishes a breach of duty in a negligence case.