Unfair Import Investigation
type: Class
alternative label: 不公平进口调查
subclass of: RCQCiKMTNRjrI3JbFdOhXu2
subclass of: RDo4EB15aAkKgGEEjd4g22i
definition: Adjudicatory investigations conducted under section 337 of the Tariff Act of 1930, frequently involving allegations of patent or trademark infringement.