Oil Rights
type: Class
subclass of: R9jGsr6LEcgGQxDRMlckOMm
definition: These rights pertain to the ownership and control of oil reserves located beneath a specific parcel of land. The owner of these rights can extract the oil or lease, sell, or transfer these rights to another party.