New York City Court - Buffalo Viol.
type: Class
subclass of: RCz0OhGJQscjwPvw2jQBP63
definition: A court located in Buffalo, New York that has jurisdiction over violations of the law within its geographical area.