Slander of Title
type: Class
alternative label: 名誉诽谤
subclass of: R7JKVOM2aFkvG1yiLzF7ndA
subclass of: RDSBerlLWg1ntpLqDQn1eVn
definition: The term "Slander of Title" refers to a false and malicious statement made about someone's property or ownership rights, which causes harm to their reputation and results in financial loss or damages.