Health Care Industry
type: Class
alternative label: 医疗保健行业
subclass of: RDIwFaFcH4KY0gwEY0QlMTp
hidden label: HTC
definition: This industry group comprises establishments providing health care and social assistance for individuals. The sector includes both health care and social assistance.