Negligent Infliction of Emotional Distress
type: Class
alternative label: 过失造成情感伤害
subclass of: R9IldpgAfUyz3upHKvXdn8y
definition: Negligent Infliction of Emotional Distress refers to a legal claim that arises when a person suffers emotional harm due to the negligent actions of another party, either as a direct victim or as a bystander.