Failure to Exhaust Contractual Remedy
type: Class
alternative label: 未尽合同救济义务
subclass of: RXfDG78SSnJOuZPWGq21Ab
definition: The Failure to Exhaust Contractual Remedy is a defense in civil litigation where the defendant argues that the plaintiff did not fulfill the contractual obligations before filing a lawsuit.