Email Management
type: Class
subclass of: ROb7P1zmS9dqMfXoFzhfu6
definition: Email Management refers to the process of organizing, storing, and retrieving electronic messages in a business or legal setting.