Fee Increase or Decrease
type: Class
alternative label: 费用增加或减少
subclass of: R8DuEmmnbcptnIZhPdF2Tvx
definition: A Fee Increase or Decrease is a type of discount or credit that modifies the original cost of legal services provided, resulting in either an increase or decrease in the overall fee charged.