Local Ruleset
type: Class
alternative label: 本地规则集
subclass of: RDVdjLF5bcB64xE1k3fVCV1
definition: A Local Ruleset is a specific set of rules that govern a particular jurisdiction or court, typically created by the court itself or a local governing body.