Interim Operations Provisions
type: Class
alternative label: 临时运营规定
subclass of: RHZTIZfN6Fbrf6azRExLaD
definition: Interim Operations Provisions are legal clauses that are included in a contract to regulate the actions of parties during the period between the signing of the contract and its completion, often to protect the interests of one or more parties.