Minnesota District Court - Ramsey County
type: Class
subclass of: RxLV9XEaDWbDIA8N1fl2fM
definition: Minnesota District Court - Ramsey County: A specific court within the Minnesota District Court system that has jurisdiction over legal proceedings in Ramsey County.