Arbitrators/Mediators Expense
type: Class
alternative label: 仲裁员/调解员费用
subclass of: R8KRPJpptKbBzyQalWni4Zv
definition: The Arbitrators/Mediators Expense concept refers to the costs incurred by parties in a legal matter for the services of an impartial third party who facilitates negotiations and resolution of disputes outside of court.