Pharmaceutical and Medicine Manufacturing
type: Class
alternative label: 制药工业
subclass of: RBrBYbsaP35Zqr9ZrYFHMda
hidden label: PHA
definition: This industry comprises establishments primarily engaged in one or more of the following: (1) manufacturing biological and medicinal products; (2) processing (i.e., grading, grinding, and milling) botanical drugs and herbs; (3) isolating active medicinal principals from botanical drugs and herbs; and (4) manufacturing pharmaceutical products intended for internal and external consumption in such forms as ampoules, tablets, capsules, vials, ointments, powders, solutions, and suspensions.