Georgia District Court - Pierce County
type: Class
subclass of: RBxw7BF15bDA0Ifn2vOrC8h
definition: Georgia District Court - Pierce County: A court of law in the state of Georgia that has jurisdiction over legal disputes and criminal cases within Pierce County.