Indiana Superior Court - Jasper County
type: Class
subclass of: R7uq2Mq8qLUybQoDhVczzZ5
definition: Indiana Superior Court - Jasper County refers to a specific court within the Indiana Superior Court system that has jurisdiction over legal matters in Jasper County, Indiana.