New York Supreme Court - Orange County
type: Class
subclass of: R06956a0657387D6513A8528
definition: A court located in Orange County, New York that has jurisdiction over civil and criminal cases within its geographical area.