Swedish
type: Class
alternative label: 瑞典语
subclass of: RDOvAHsvY8TKJ1O1orXPM9o
definition: Swedish (Language) refers to the written or spoken structured system of communication that consists of grammar and vocabulary specific to the Swedish language, which is a subset of the broader category of Language.