Taxes Motion
type: Class
alternative label: 税务动议
subclass of: R7QiKeEkci1FYlRMv6nDRnv
definition: A Taxes Motion (Bankruptcy) is a request made by a debtor in bankruptcy court seeking permission to pay taxes owed by the debtor or the bankruptcy estate.