File Item Number
type: Class
alternative label: 文件项目编号
subclass of: RBQwuwI8kIy4gvRmoiZHA5m
definition: File Item Number refers to a unique identifier assigned to a specific item or task within an invoice for legal services.