Change of Recommendation Trigger
type: Class
alternative label: 推荐更改触发器
subclass of: R8rgsxWmEx8qQqXMEtuobJx
subclass of: RCDa7IsUxl4AA7e5KylzJYK
definition: Change of Recommendation Trigger refers to a provision in a fiduciary exemption to a change of recommendation covenant or a breakup fee trigger that allows for a change in the recommendation of a merger or acquisition based on certain events or circumstances.