Compliance
type: Class
alternative label: Legal Compliance
subclass of: RClhbl4E1TJp9LygIXewIhn
definition: Deontic compliance refers to the conformity in action, behavior, or attitude to a set of rules or standards, as prescribed by laws, regulations, or ethical principles.