Policy Document
type: Class
preferred label: Guidelines
alternative label: 政策文件
subclass of: R99VQVUo93kYqqhla6ZUJTC
definition: A Policy Document is a written or presented representation of a set of principles or guidelines that provide direction for decision-making and action in a particular area, created with the intention of guiding behavior and achieving specific goals.