Jury Instructions
type: Class
alternative label: 陪审团指示
subclass of: RDBXUrFP9mCZLCxzqy8nbEX
definition: Jury Instructions are written directions given by a judge to a jury during a trial, explaining the law that applies to the case and how the jury should evaluate the evidence presented.