Oregon Employee Relations Board
type: Class
subclass of: REFC692441d584AA9b849464
definition: The Oregon Employee Relations Board is a state agency responsible for administering and enforcing laws related to labor relations and collective bargaining in Oregon.