Sequestration
type: Class
alternative label: 扣押
subclass of: R9pQxz2fUIrk1LjvVP8hikg
subclass of: RDKm1RXP9FfvhLzWjynAfpS
definition: The concept of Sequestration refers to the legal process of taking possession of property or assets by a court-appointed trustee in order to enforce a judgment.