JI30 Costs Management Conference (UK J-CODE)
type: Class
subclass of: RCnw92nYvQRBBL2Nmumdg5S
definition: Work in preparing for and attending any Costs Management Conference / Hearing including the hearing of any applications to vary a budget.