Federal Preemption
type: Class
alternative label: 联邦优先权
subclass of: RB7BB00LuJawNLM8CZW6z7U
subclass of: RBoyPCQL9cRuwbjeNvSO55y
definition: The concept of Federal Preemption refers to the legal principle that federal law takes precedence over state law in cases where there is a conflict between the two.