Right of Offset Clause
type: Class
alternative label: 抵销条款
subclass of: RDe0RKU39BlhcyACJW30ZLc
definition: A Right of Offset Clause is a provision in a contract that allows one party to offset or deduct any amount owed to them by the other party from any amount owed by them, in order to settle the debt.