Indiana Circuit Court - Owen County Circuit 2
type: Class
subclass of: RCeiXNGpqL4H3jo1g1NobSm
definition: A court of general jurisdiction in Indiana that has the authority to hear a wide range of civil and criminal cases within Owen County.