Tsonga
type: Class
alternative label: 聪萨语
subclass of: RDOvAHsvY8TKJ1O1orXPM9o
definition: Tsonga is a structured system of communication consisting of grammar and vocabulary, and is a specific language within the context of legal matters.