Cybercrime Law
type: Class
alternative label: 网络犯罪法
subclass of: RMZ6lNihK8TG4Flhco1yTy
hidden label: CYBR
definition: Crimes committed using a computer or directed at computers, data, or other information technology - piracy, hacking, etc.