Cross-Designation
type: Class
alternative label: 交叉指定
subclass of: R7wLLoc6H1zcuVpchb4e5lQ
definition: Cross-Designation refers to the act of designating a party or a document in a legal case with a different name or title than originally given, and it falls under the category of Appellate Filings - Correspondence and Forms.