Somatic Symptom Disorder
type: Class
alternative label: Somatic Disorder
alternative label: Somatoform Disorder
subclass of: R8Yn0rpoHNTFiymo0I8CAVf
definition: Somatic Symptom Disorder is characterized by one or more physical symptoms that cause significant distress or impairment in daily functioning, with excessive thoughts, feelings, or behaviors related to the symptoms. The physical symptoms cannot be fully explained by a medical condition, substance use, or another mental disorder.