Divehi; Dhivehi; Maldivian
type: Class
alternative label: 迪维希语; 丹维基语; 马尔代夫语
subclass of: RDOvAHsvY8TKJ1O1orXPM9o
definition: A language spoken in the Maldives, also known as Divehi or Dhivehi, which belongs to the top-level class of Language.